Merge branch 'develop' into 'master'

Develop

See merge request !14
Status Job ID Name Coverage
  Test
failed #9181
build

00:00:37

 
Name Stage Failure
failed
build Test
npm WARN tar ENOENT: no such file or directory, lstat '/builds/br/chocapix-client/node_modules/.staging/unicode-5.2.0-f3460286/General_Category/Uppercase_Letter'
npm WARN tar ENOENT: no such file or directory, lstat '/builds/br/chocapix-client/node_modules/.staging/unicode-5.2.0-f3460286/General_Category/Uppercase_Letter'

npm ERR! A complete log of this run can be found in:
npm ERR! /tmp/npmgq7ZzX/.npm/_logs/2019-11-14T14_35_38_721Z-debug.log
sudo: node_modules/.bin/gulp: command not found
Makefile:4: recipe for target 'install' failed
make: *** [install] Error 1
ERROR: Job failed: exit code 1