Removed bower req, TODO:inject deps

Status Job ID Name Coverage
  Test
failed #9182
build

00:00:29

 
Name Stage Failure
failed
build Test
npm ERR! 404 Note that you can also install from a
npm ERR! 404 tarball, folder, http url, or git url.

npm ERR! A complete log of this run can be found in:
npm ERR! /tmp/npm8Isaz2/.npm/_logs/2019-11-14T17_41_34_852Z-debug.log
sudo: node_modules/.bin/gulp: command not found
make: *** [install] Error 1
Makefile:4: recipe for target 'install' failed
ERROR: Job failed: exit code 1